BDBM293987 5-((2S)-2-(4-((2-Methyl-3-(2- methylphenyl)benzo[b]thiophen- 5-yl)methoxy)phenyl)pent-3- ynyl)-1H-tetrazole::US10106553, Compound 19
SMILES CC#C[C@@H](Cc1nnn[nH]1)c1ccc(OCc2ccc3sc(C)c(-c4ccccc4C)c3c2)cc1
InChI Key
Data  3 EC50
  Tab Delimited (TSV)   2D SDfile   Computed 3D by Vconf -m prep SDfile
Find this compound or compounds like it in BindingDB:
Activity Spreadsheet -- Enzyme Inhibition Constant Data from BindingDB
Found 1 hit for monomerid = 293987
TargetMelanocortin receptor 4(Rattus norvegicus)TBA
LigandPNGBDBM293987(5-((2S)-2-(4-((2-Methyl-3-(2- methylphenyl)benzo[b...)
Affinity DataEC50:  10nM. Assay description: Agonist activity at rat GPR40 assessed as increase in intracellular calcium flux by cell based FLIPR assay
Ligand InfoPC cidPC sid
In DepthDetails ArticlePubMed